← Jobs
failure

test ant/term ↗

main @ e33ce96d64041ec6007e6792c950d25e9bd6f3e0 · pipeline test #10 → · 2 more pipelines from this commit →
started 14 Sep 2026 20:57 UTC · ran for
10s, success 9s, success 10s, success 10s, success 12s, success 13s, success 13s, success 12s, success 12s, success 12s, success avg 11s ± 1s over the last 10 runs
events: don't snap the window to the default size on a 0-sized configure xdg_surface.configure can legally carry a 0-sized pending dimension ("you choose") on any configure, not just the first one. Falling back to the hardcoded default in that case snapped an already-configured window back to 800x600 instead of keeping its current size.
$ test failure · exit 1 · raw
++ mktemp -d
+ checkout=/tmp/tmp.gTc2iLLwJ9
+ trap 'rm -rf "$checkout"' EXIT
+ cp -R /var/lib/ci-tron/sources/156c01923ba52f8f/. /tmp/tmp.gTc2iLLwJ9
+ cd /tmp/tmp.gTc2iLLwJ9
+ nix develop --command odin test . -all-packages
GC Warning: Could not open /proc/stat
[INFO ] --- [2026-09-14 20:57:14] Starting test runner with 12 threads. Set with -define:ODIN_TEST_THREADS=n.
[INFO ] --- [2026-09-14 20:57:14] The random seed sent to every test is: 60651929420892. Set with -define:ODIN_TEST_RANDOM_SEED=n.
[INFO ] --- [2026-09-14 20:57:14] Memory tracking is enabled. Tests will log their memory usage if there's an issue.
[INFO ] --- [2026-09-14 20:57:14] < Final Mem/ Total Mem> < Peak Mem> (#Free/Alloc) :: [package.test_name]
[ERROR] --- [2026-09-14 20:57:14] [e2e_test.odin:298:test_e2e_basic_shell_roundtrip()] FAIL: e2e_start failed (pty spawn or font init)
[ERROR] --- [2026-09-14 20:57:14] [e2e_test.odin:569:test_e2e_decawm_autowrap_off()] FAIL: e2e_start failed
[ERROR] --- [2026-09-14 20:57:14] [e2e_test.odin:524:test_e2e_cha_vpa()] FAIL: e2e_start failed
[ERROR] --- [2026-09-14 20:57:14] [e2e_test.odin:395:test_e2e_decsc_decrc_independent_of_alt_screen()] FAIL: e2e_start failed
[ERROR] --- [2026-09-14 20:57:14] [e2e_test.odin:479:test_e2e_char_editing()] FAIL: e2e_start failed
[ERROR] --- [2026-09-14 20:57:14] [e2e_test.odin:354:test_e2e_decstbm_scroll_region()] FAIL: e2e_start failed
[ERROR] --- [2026-09-14 20:57:14] [e2e_test.odin:591:test_e2e_cursor_visibility()] FAIL: e2e_start failed
[ERROR] --- [2026-09-14 20:57:14] [e2e_test.odin:449:test_e2e_line_editing()] FAIL: e2e_start failed
[ERROR] --- [2026-09-14 20:57:14] [e2e_test.odin:378:test_e2e_reverse_index()] FAIL: e2e_start failed
[ERROR] --- [2026-09-14 20:57:14] [e2e_test.odin:642:test_e2e_sgr_new_attributes_render()] FAIL: e2e_start failed
[ERROR] --- [2026-09-14 20:57:14] [e2e_test.odin:422:test_e2e_ris_full_reset()] FAIL: e2e_start failed
[ERROR] --- [2026-09-14 20:57:14] [e2e_test.odin:329:test_e2e_resize_reflows_grid_and_pty()] FAIL: e2e_start failed (pty spawn or font init)
[ERROR] --- [2026-09-14 20:57:14] [e2e_test.odin:620:test_e2e_dsr_da_reply_round_trip()] FAIL: e2e_start failed
[ERROR] --- [2026-09-14 20:57:14] [e2e_test.odin:544:test_e2e_tab_stops()] FAIL: e2e_start failed
Finished 137 tests in 6.637313ms. 14 tests failed.
- main.test_e2e_basic_shell_roundtrip FAIL: e2e_start failed (pty spawn or font init)
- main.test_e2e_cha_vpa FAIL: e2e_start failed
- main.test_e2e_char_editing FAIL: e2e_start failed
- main.test_e2e_cursor_visibility FAIL: e2e_start failed
- main.test_e2e_decawm_autowrap_off FAIL: e2e_start failed
- main.test_e2e_decsc_decrc_independent_of_alt_screen FAIL: e2e_start failed
- main.test_e2e_decstbm_scroll_region FAIL: e2e_start failed
- main.test_e2e_dsr_da_reply_round_trip FAIL: e2e_start failed
- main.test_e2e_line_editing FAIL: e2e_start failed
- main.test_e2e_resize_reflows_grid_and_pty FAIL: e2e_start failed (pty spawn or font init)
- main.test_e2e_reverse_index FAIL: e2e_start failed
- main.test_e2e_ris_full_reset FAIL: e2e_start failed
- main.test_e2e_sgr_new_attributes_render FAIL: e2e_start failed
- main.test_e2e_tab_stops FAIL: e2e_start failed
To run only the failed tests, use:
-define:ODIN_TEST_NAMES=main.test_e2e_basic_shell_roundtrip,main.test_e2e_cha_vpa,main.test_e2e_char_editing,main.test_e2e_cursor_visibility,main.test_e2e_decawm_autowrap_off,main.test_e2e_decsc_decrc_independent_of_alt_screen,main.test_e2e_decstbm_scroll_region,main.test_e2e_dsr_da_reply_round_trip,main.test_e2e_line_editing,main.test_e2e_resize_reflows_grid_and_pty,main.test_e2e_reverse_index,main.test_e2e_ris_full_reset,main.test_e2e_sgr_new_attributes_render,main.test_e2e_tab_stops,
If your terminal supports OSC 52, you may use -define:ODIN_TEST_CLIPBOARD to have this copied directly to your clipboard.
+ rm -rf /tmp/tmp.gTc2iLLwJ9
Artifacts

no artifacts