← Jobs
failure

test ant/term ↗

main @ 569fb831881d6c6127e349806195efd938b6fad4 · pipeline test #16 → · 2 more pipelines from this commit →
started 15 Sep 2026 07:46 UTC · ran for
10s, success 9s, success 10s, success 10s, success 12s, success 13s, success 13s, success 12s, success 12s, success 12s, success avg 11s ± 1s over the last 10 runs
docs: update ROADMAP for wide-char/paste/OSC52/DECRQM work Move the now-implemented items (wide/zero-width rune width, clipboard paste + bracketed paste, OSC 52 clipboard write, DECRQM/DECRPM + kitty-keyboard-query replies) from Later into v1 (done), and note the residual gaps each left behind (combining marks still dropped, primary selection and the OSC 52 query form still unsupported, kitty protocol's actual key encoding still missing) in Later/Known v1 limitations.
$ test failure · exit 1 · raw
++ mktemp -d
+ checkout=/tmp/tmp.we3aad2ndB
+ trap 'rm -rf "$checkout"' EXIT
+ cp -R /var/lib/ci-tron/sources/82b6fea60a621fd0/. /tmp/tmp.we3aad2ndB
+ cd /tmp/tmp.we3aad2ndB
+ nix develop --command odin test . -all-packages
GC Warning: Could not open /proc/stat
[INFO ] --- [2026-09-15 07:46:53] Starting test runner with 12 threads. Set with -define:ODIN_TEST_THREADS=n.
[INFO ] --- [2026-09-15 07:46:53] The random seed sent to every test is: 195362779201884. Set with -define:ODIN_TEST_RANDOM_SEED=n.
[INFO ] --- [2026-09-15 07:46:53] Memory tracking is enabled. Tests will log their memory usage if there's an issue.
[INFO ] --- [2026-09-15 07:46:53] < Final Mem/ Total Mem> < Peak Mem> (#Free/Alloc) :: [package.test_name]
[ERROR] --- [2026-09-15 07:46:53] [e2e_test.odin:591:test_e2e_cursor_visibility()] FAIL: e2e_start failed
[ERROR] --- [2026-09-15 07:46:53] [e2e_test.odin:298:test_e2e_basic_shell_roundtrip()] FAIL: e2e_start failed (pty spawn or font init)
[ERROR] --- [2026-09-15 07:46:53] [e2e_test.odin:620:test_e2e_dsr_da_reply_round_trip()] FAIL: e2e_start failed
[ERROR] --- [2026-09-15 07:46:53] [e2e_test.odin:395:test_e2e_decsc_decrc_independent_of_alt_screen()] FAIL: e2e_start failed
[ERROR] --- [2026-09-15 07:46:53] [e2e_test.odin:524:test_e2e_cha_vpa()] FAIL: e2e_start failed
[ERROR] --- [2026-09-15 07:46:53] [e2e_test.odin:569:test_e2e_decawm_autowrap_off()] FAIL: e2e_start failed
[ERROR] --- [2026-09-15 07:46:53] [e2e_test.odin:479:test_e2e_char_editing()] FAIL: e2e_start failed
[ERROR] --- [2026-09-15 07:46:53] [e2e_test.odin:354:test_e2e_decstbm_scroll_region()] FAIL: e2e_start failed
[ERROR] --- [2026-09-15 07:46:53] [e2e_test.odin:449:test_e2e_line_editing()] FAIL: e2e_start failed
[ERROR] --- [2026-09-15 07:46:53] [e2e_test.odin:329:test_e2e_resize_reflows_grid_and_pty()] FAIL: e2e_start failed (pty spawn or font init)
[ERROR] --- [2026-09-15 07:46:53] [e2e_test.odin:378:test_e2e_reverse_index()] FAIL: e2e_start failed
[ERROR] --- [2026-09-15 07:46:53] [e2e_test.odin:422:test_e2e_ris_full_reset()] FAIL: e2e_start failed
[ERROR] --- [2026-09-15 07:46:53] [e2e_test.odin:642:test_e2e_sgr_new_attributes_render()] FAIL: e2e_start failed
[ERROR] --- [2026-09-15 07:46:53] [e2e_test.odin:544:test_e2e_tab_stops()] FAIL: e2e_start failed
Finished 165 tests in 8.662506ms. 14 tests failed.
- main.test_e2e_basic_shell_roundtrip FAIL: e2e_start failed (pty spawn or font init)
- main.test_e2e_cha_vpa FAIL: e2e_start failed
- main.test_e2e_char_editing FAIL: e2e_start failed
- main.test_e2e_cursor_visibility FAIL: e2e_start failed
- main.test_e2e_decawm_autowrap_off FAIL: e2e_start failed
- main.test_e2e_decsc_decrc_independent_of_alt_screen FAIL: e2e_start failed
- main.test_e2e_decstbm_scroll_region FAIL: e2e_start failed
- main.test_e2e_dsr_da_reply_round_trip FAIL: e2e_start failed
- main.test_e2e_line_editing FAIL: e2e_start failed
- main.test_e2e_resize_reflows_grid_and_pty FAIL: e2e_start failed (pty spawn or font init)
- main.test_e2e_reverse_index FAIL: e2e_start failed
- main.test_e2e_ris_full_reset FAIL: e2e_start failed
- main.test_e2e_sgr_new_attributes_render FAIL: e2e_start failed
- main.test_e2e_tab_stops FAIL: e2e_start failed
To run only the failed tests, use:
-define:ODIN_TEST_NAMES=main.test_e2e_basic_shell_roundtrip,main.test_e2e_cha_vpa,main.test_e2e_char_editing,main.test_e2e_cursor_visibility,main.test_e2e_decawm_autowrap_off,main.test_e2e_decsc_decrc_independent_of_alt_screen,main.test_e2e_decstbm_scroll_region,main.test_e2e_dsr_da_reply_round_trip,main.test_e2e_line_editing,main.test_e2e_resize_reflows_grid_and_pty,main.test_e2e_reverse_index,main.test_e2e_ris_full_reset,main.test_e2e_sgr_new_attributes_render,main.test_e2e_tab_stops,
If your terminal supports OSC 52, you may use -define:ODIN_TEST_CLIPBOARD to have this copied directly to your clipboard.
+ rm -rf /tmp/tmp.we3aad2ndB
Artifacts

no artifacts