failure
test ant/term ↗
main @ d59b3534fa63f2c42a6a939d6a6cbc6dfeb5bbd0
· pipeline test #19 →
· 2 more pipelines from this commit →
started 16 Sep 2026 13:46 UTC · ran for
avg 11s ± 1s over the last 10 runs
++ mktemp -d
+ checkout=/tmp/tmp.IGEEWGMeGv
+ trap 'rm -rf "$checkout"' EXIT
+ cp -R /var/lib/ci-tron/sources/e37cc97bbf2e7e34/. /tmp/tmp.IGEEWGMeGv
+ cd /tmp/tmp.IGEEWGMeGv
+ nix develop --command odin test . -all-packages
GC Warning: Could not open /proc/stat
copying path '/nix/store/096qps0fnigc8ah17hwafr5vra6a3wj0-fira-code-6.2' from 'https://cache.nixos.org'...
copying path '/nix/store/cni8h48r0c96xjlndndabai63hz9dmzr-die-hook' from 'https://cache.nixos.org'...
copying path '/nix/store/6nnarydxi016l6vl7rm3s7yplm1rxm8w-ncurses-6.5-man' from 'https://cache.nixos.org'...
copying path '/nix/store/a3dmb85n5k4n0v0yp775y9hbma7dgggg-file-5.45' from 'https://cache.nixos.org'...
copying path '/nix/store/65a83xxyjb09dz0f91y9kwm72v458ggx-fontconfig-2.17.1' from 'https://cache.nixos.org'...
copying path '/nix/store/74012lhlhrqacay57irb45csa3ym7kgk-hostname-debian-3.25-man' from 'https://cache.nixos.org'...
copying path '/nix/store/3li179rbvavicn6jamhi2nxzsf09w1da-perl5.40.0-Encode-Locale-1.05' from 'https://cache.nixos.org'...
copying path '/nix/store/2rxalpphb85idz7r9wb1843ar6ckdm18-perl5.40.0-HTML-Tagset-3.20' from 'https://cache.nixos.org'...
copying path '/nix/store/nwyw9hhpi3hwd0q8893lzickag78pz8r-perl5.40.0-IO-HTML-1.004' from 'https://cache.nixos.org'...
copying path '/nix/store/w4p218gjgdf2wyxdnb9kfi5bql6a13ff-perl5.40.0-IPC-System-Simple-1.30' from 'https://cache.nixos.org'...
copying path '/nix/store/bhdlb7gx2rxr8ibxmcdg0lhlmsh9q6nl-perl5.40.0-LWP-MediaTypes-6.04' from 'https://cache.nixos.org'...
copying path '/nix/store/ji9p53rza4s127zssnc2aapsicfr26k8-perl5.40.0-TimeDate-2.33' from 'https://cache.nixos.org'...
copying path '/nix/store/mh7w99pvgf8cw6wvvl0nmsqll6i8n4mq-perl5.40.0-Try-Tiny-0.31' from 'https://cache.nixos.org'...
copying path '/nix/store/4dgcknx1ki4xykkbf7c2z3ybnfpapyx5-perl5.40.0-URI-5.21' from 'https://cache.nixos.org'...
copying path '/nix/store/93akv1azjx7219i5lpz031h7njjs5zcq-graphite2-1.3.14' from 'https://cache.nixos.org'...
copying path '/nix/store/6lfcbqqrjh704q81jyfj2jkm5f25j345-libselinux-3.8.1' from 'https://cache.nixos.org'...
copying path '/nix/store/ibygskybdzz9b4mdyn0xhza4rb0ab4jj-hostname-debian-3.25' from 'https://cache.nixos.org'...
copying path '/nix/store/ammry9gjdzz6q1nilriax65zc75f5q4f-oniguruma-6.9.10-lib' from 'https://cache.nixos.org'...
copying path '/nix/store/55c9z5n6flgs7mcsw9rsy0ldnxkbxwnn-perl-5.40.0' from 'https://cache.nixos.org'...
copying path '/nix/store/rjs6prgms4a16k5a4c7z90m6xknhlhvi-perl5.40.0-Clone-0.46' from 'https://cache.nixos.org'...
copying path '/nix/store/rwx2g6byfnzab02rhmr2kcblhzppnhy8-perl5.40.0-Test-Needs-0.002010' from 'https://cache.nixos.org'...
copying path '/nix/store/bczp7i028rlsb5fz0cy4apy292jdjy8z-perl5.40.0-Test-RequiresInternet-0.05' from 'https://cache.nixos.org'...
copying path '/nix/store/idq5kxqha7dsq7s4p2n2wm3ygdzky59b-hostname-hostname-debian-3.25' from 'https://cache.nixos.org'...
copying path '/nix/store/3ijxymd73jhgp3j37kvv50c9w9fjflfz-perl5.40.0-HTTP-Date-6.06' from 'https://cache.nixos.org'...
copying path '/nix/store/szn89qf7w3ndjc0by7gqvzvsmb8vai4j-perl5.40.0-Net-HTTP-6.23' from 'https://cache.nixos.org'...
copying path '/nix/store/dkc0qzar8f5yp3yzxv2wg448rf04b101-glib-2.86.3' from 'https://cache.nixos.org'...
copying path '/nix/store/jrshlnapbhyf6anfqlg8s5lmqpqgi1q1-graphite2-1.3.14-dev' from 'https://cache.nixos.org'...
copying path '/nix/store/hvis38ixpb63308zi0qpz6abqggkn0i3-perl5.40.0-WWW-RobotRules-6.02' from 'https://cache.nixos.org'...
copying path '/nix/store/l1qmms0d308cspszb1p0kyjkvnxc9m3n-systemd-minimal-libs-258.7' from 'https://cache.nixos.org'...
copying path '/nix/store/byp36rn94r7sbsg01cy1zzlmyhhclbp5-which-2.23' from 'https://cache.nixos.org'...
copying path '/nix/store/9bl4bqnjk4bf5f4hjlb0jdhbvkl2m9pg-jq-1.8.1-bin' from 'https://cache.nixos.org'...
copying path '/nix/store/qk84s041nx0c42n77llfp676wy34w8x5-fontconfig-2.17.1-bin' from 'https://cache.nixos.org'...
copying path '/nix/store/k9wyc5v2q50cgpdyls5c22xk18nk6hjh-perl5.40.0-Test-Fatal-0.017' from 'https://cache.nixos.org'...
copying path '/nix/store/h8h7ayrsnmiyy0gx0in05h8d9r8nfzmi-perl5.40.0-File-BaseDir-0.09' from 'https://cache.nixos.org'...
copying path '/nix/store/ksadqf4whnx22mzgagrxx55qgfls99mn-perl5.40.0-HTTP-CookieJar-0.014' from 'https://cache.nixos.org'...
copying path '/nix/store/d3w16zr2ig3w9xbsbzpfx8ffmkhahs85-perl5.40.0-HTTP-Message-6.45' from 'https://cache.nixos.org'...
copying path '/nix/store/d8kx658cx60l5rm7kqxdbwq1kja58xv9-perl5.40.0-File-DesktopEntry-0.22' from 'https://cache.nixos.org'...
copying path '/nix/store/fjbdd14llanic67a657591p8df3gxpdg-perl5.40.0-HTML-Parser-3.81' from 'https://cache.nixos.org'...
copying path '/nix/store/q864vkqgjk0acq6rp35vnb7hppcsly8y-harfbuzz-12.1.0-dev' from 'https://cache.nixos.org'...
copying path '/nix/store/awajqzf42jn3wfvbdlsv9pxfmz7fzd27-wl-clipboard-2.3.0' from 'https://cache.nixos.org'...
[INFO ] --- [2026-09-16 13:46:48] Starting test runner with 12 threads. Set with -define:ODIN_TEST_THREADS=n.
[INFO ] --- [2026-09-16 13:46:48] The random seed sent to every test is: 568588975478460. Set with -define:ODIN_TEST_RANDOM_SEED=n.
[INFO ] --- [2026-09-16 13:46:48] Memory tracking is enabled. Tests will log their memory usage if there's an issue.
[INFO ] --- [2026-09-16 13:46:48] < Final Mem/ Total Mem> < Peak Mem> (#Free/Alloc) :: [package.test_name]
[ERROR] --- [2026-09-16 13:46:48] [e2e_test.odin:592:test_e2e_char_editing()] expected vt.at(&e.grid, 1, 0)^.ch to be b, got
[ERROR] --- [2026-09-16 13:46:48] [e2e_test.odin:593:test_e2e_char_editing()] expected vt.at(&e.grid, 2, 0)^.ch to be c, got
[ERROR] --- [2026-09-16 13:46:48] [e2e_test.odin:594:test_e2e_char_editing()] expected vt.at(&e.grid, 3, 0)^.ch to be d, got
[ERROR] --- [2026-09-16 13:46:48] [e2e_test.odin:604:test_e2e_char_editing()] expected vt.at(&e.grid, 2, 0)^.ch to be c, got D
term: --class requires an argument
usage: term [--class <app_id>] [--working-directory <dir>] [-e <command> [args...]]
term: -e requires a command
usage: term [--class <app_id>] [--working-directory <dir>] [-e <command> [args...]]
term: --working-directory requires an argument
usage: term [--class <app_id>] [--working-directory <dir>] [-e <command> [args...]]
term: unknown flag "--bogus"
usage: term [--class <app_id>] [--working-directory <dir>] [-e <command> [args...]]
[ERROR] --- [2026-09-16 13:46:48] [e2e_test.odin:558:test_e2e_line_editing()] expected vt.at(&e.grid, 0, 1)^.ch to be r, got I
[ERROR] --- [2026-09-16 13:46:48] [e2e_test.odin:559:test_e2e_line_editing()] expected vt.at(&e.grid, 1, 1)^.ch to be 1, got L
[ERROR] --- [2026-09-16 13:46:57] [e2e_tmux_test.odin:33:test_e2e_tmux_secondary_da_no_corruption()] expected e2e_pump_until(&e, "$ ") to be true
[ERROR] --- [2026-09-16 13:46:57] [e2e_tmux_test.odin:34:test_e2e_tmux_secondary_da_no_corruption()] expected e.grid.in_alt to be true, got false
[ERROR] --- [2026-09-16 13:46:57] [e2e_tmux_test.odin:37:test_e2e_tmux_secondary_da_no_corruption()] expected e2e_pump_until(&e, "\x1b[?1049l") to be true
[ERROR] --- [2026-09-16 13:46:57] [e2e_tmux_test.odin:50:test_e2e_tmux_secondary_da_no_corruption()] expected vt.at(&e.grid, 0, before_y)^.ch to be [, got
Finished 224 tests in 8.433142606s. 3 tests failed.
- main.test_e2e_char_editing expected vt.at(&e.grid, 2, 0)^.ch to be c, got D
- main.test_e2e_line_editing expected vt.at(&e.grid, 1, 1)^.ch to be 1, got L
- main.test_e2e_tmux_secondary_da_no_corruption expected vt.at(&e.grid, 0, before_y)^.ch to be [, got
To run only the failed tests, use:
-define:ODIN_TEST_NAMES=main.test_e2e_char_editing,main.test_e2e_line_editing,main.test_e2e_tmux_secondary_da_no_corruption,
If your terminal supports OSC 52, you may use -define:ODIN_TEST_CLIPBOARD to have this copied directly to your clipboard.
+ rm -rf /tmp/tmp.IGEEWGMeGv
no artifacts