failure
test ant/term ↗
main @ 6b2904a2c18aba778bde15b46b6cacb5a414bb8d
· pipeline test #28 →
· 2 more pipelines from this commit →
started 17 Sep 2026 08:18 UTC · ran for
avg 11s ± 1s over the last 10 runs
++ mktemp -d
+ checkout=/tmp/tmp.AzLUeJrm3Y
+ trap 'rm -rf "$checkout"' EXIT
+ cp -R /var/lib/ci-tron/sources/9520ac1484a9286e/. /tmp/tmp.AzLUeJrm3Y
+ cd /tmp/tmp.AzLUeJrm3Y
+ nix develop --command odin test . -all-packages
GC Warning: Could not open /proc/stat
[INFO ] --- [2026-09-17 08:18:42] Starting test runner with 12 threads. Set with -define:ODIN_TEST_THREADS=n.
[INFO ] --- [2026-09-17 08:18:42] The random seed sent to every test is: 799149561257808. Set with -define:ODIN_TEST_RANDOM_SEED=n.
[INFO ] --- [2026-09-17 08:18:42] Memory tracking is enabled. Tests will log their memory usage if there's an issue.
[INFO ] --- [2026-09-17 08:18:42] < Final Mem/ Total Mem> < Peak Mem> (#Free/Alloc) :: [package.test_name]
Fontconfig error: No writable cache directories
/tmp/tmp.ZXBGzQCpd4/.cache/fontconfig
/var/cache/fontconfig
/nix/store/7s879ridd8xfxajagsjzcb41vv1snp17-fc-cache
[ERROR] --- [2026-09-17 08:18:42] [e2e_test.odin:592:test_e2e_char_editing()] expected vt.at(&e.grid, 1, 0)^.ch to be b, got
[ERROR] --- [2026-09-17 08:18:42] [e2e_test.odin:593:test_e2e_char_editing()] expected vt.at(&e.grid, 2, 0)^.ch to be c, got
[ERROR] --- [2026-09-17 08:18:42] [e2e_test.odin:594:test_e2e_char_editing()] expected vt.at(&e.grid, 3, 0)^.ch to be d, got
[ERROR] --- [2026-09-17 08:18:42] [e2e_test.odin:604:test_e2e_char_editing()] expected vt.at(&e.grid, 2, 0)^.ch to be c, got D
[ERROR] --- [2026-09-17 08:18:50] [e2e_tmux_test.odin:33:test_e2e_tmux_secondary_da_no_corruption()] expected e2e_pump_until(&e, "$ ") to be true
[ERROR] --- [2026-09-17 08:18:50] [e2e_tmux_test.odin:34:test_e2e_tmux_secondary_da_no_corruption()] expected e.grid.in_alt to be true, got false
[ERROR] --- [2026-09-17 08:18:50] [e2e_tmux_test.odin:37:test_e2e_tmux_secondary_da_no_corruption()] expected e2e_pump_until(&e, "\x1b[?1049l") to be true
[ERROR] --- [2026-09-17 08:18:50] [e2e_tmux_test.odin:50:test_e2e_tmux_secondary_da_no_corruption()] expected vt.at(&e.grid, 0, before_y)^.ch to be [, got
term: --class requires an argument
usage: term [--class <app_id>] [--working-directory <dir>] [-e <command> [args...]]
term: -e requires a command
usage: term [--class <app_id>] [--working-directory <dir>] [-e <command> [args...]]
term: --working-directory requires an argument
usage: term [--class <app_id>] [--working-directory <dir>] [-e <command> [args...]]
term: unknown flag "--bogus"
usage: term [--class <app_id>] [--working-directory <dir>] [-e <command> [args...]]
[ERROR] --- [2026-09-17 08:18:50] [e2e_test.odin:558:test_e2e_line_editing()] expected vt.at(&e.grid, 0, 1)^.ch to be r, got I
[ERROR] --- [2026-09-17 08:18:50] [e2e_test.odin:559:test_e2e_line_editing()] expected vt.at(&e.grid, 1, 1)^.ch to be 1, got L
Finished 248 tests in 8.463129753s. 3 tests failed.
- main.test_e2e_char_editing expected vt.at(&e.grid, 2, 0)^.ch to be c, got D
- main.test_e2e_line_editing expected vt.at(&e.grid, 1, 1)^.ch to be 1, got L
- main.test_e2e_tmux_secondary_da_no_corruption expected vt.at(&e.grid, 0, before_y)^.ch to be [, got
To run only the failed tests, use:
-define:ODIN_TEST_NAMES=main.test_e2e_char_editing,main.test_e2e_line_editing,main.test_e2e_tmux_secondary_da_no_corruption,
If your terminal supports OSC 52, you may use -define:ODIN_TEST_CLIPBOARD to have this copied directly to your clipboard.
+ rm -rf /tmp/tmp.AzLUeJrm3Y
no artifacts