failure
test ant/term ↗
main @ 36f64e6a9c4e79a3c37cc90f138b53bc4a109a7e
· pipeline test #44 →
· 7 more pipelines from this commit →
started 17 Sep 2026 11:53 UTC · ran for
avg 11s ± 1s over the last 10 runs
++ mktemp -d
+ checkout=/tmp/tmp.EDg0dTHcLj
+ trap 'rm -rf "$checkout"' EXIT
+ cp -R /var/lib/ci-tron/sources/f1332289a1fb6533/. /tmp/tmp.EDg0dTHcLj
+ cd /tmp/tmp.EDg0dTHcLj
+ nix develop --command odin test . -all-packages
GC Warning: Could not open /proc/stat
[INFO ] --- [2026-09-17 11:53:44] Starting test runner with 12 threads. Set with -define:ODIN_TEST_THREADS=n.
[INFO ] --- [2026-09-17 11:53:44] The random seed sent to every test is: 843739550661528. Set with -define:ODIN_TEST_RANDOM_SEED=n.
[INFO ] --- [2026-09-17 11:53:44] Memory tracking is enabled. Tests will log their memory usage if there's an issue.
[INFO ] --- [2026-09-17 11:53:44] < Final Mem/ Total Mem> < Peak Mem> (#Free/Alloc) :: [package.test_name]
term: --class requires an argument
usage: term [--class <app_id>] [--working-directory <dir>] [-e <command> [args...]]
term: -e requires a command
usage: term [--class <app_id>] [--working-directory <dir>] [-e <command> [args...]]
term: --working-directory requires an argument
usage: term [--class <app_id>] [--working-directory <dir>] [-e <command> [args...]]
term: unknown flag "--bogus"
usage: term [--class <app_id>] [--working-directory <dir>] [-e <command> [args...]]
[ERROR] --- [2026-09-17 11:54:05] [e2e_tmux_test.odin:33:test_e2e_tmux_secondary_da_no_corruption()] expected e2e_pump_until(&e, "$ ") to be true
[ERROR] --- [2026-09-17 11:54:05] [e2e_tmux_test.odin:34:test_e2e_tmux_secondary_da_no_corruption()] expected e.grid.in_alt to be true, got false
[ERROR] --- [2026-09-17 11:54:05] [e2e_tmux_test.odin:37:test_e2e_tmux_secondary_da_no_corruption()] expected e2e_pump_until(&e, "\x1b[?1049l") to be true
[ERROR] --- [2026-09-17 11:54:05] [e2e_tmux_test.odin:50:test_e2e_tmux_secondary_da_no_corruption()] expected vt.at(&e.grid, 0, before_y)^.ch to be [, got s
Finished 254 tests in 20.600040453s. 1 test failed.
- main.test_e2e_tmux_secondary_da_no_corruption expected vt.at(&e.grid, 0, before_y)^.ch to be [, got s
To run only the failed test, use:
-define:ODIN_TEST_NAMES=main.test_e2e_tmux_secondary_da_no_corruption,
If your terminal supports OSC 52, you may use -define:ODIN_TEST_CLIPBOARD to have this copied directly to your clipboard.
+ rm -rf /tmp/tmp.EDg0dTHcLj
no artifacts