← Jobs
failure

test ant/term ↗

main @ d160eccaebbc63ab63f4b5d45ac1b0883a7b4765 · pipeline test #100 → · 2 more pipelines from this commit →
started 23 Sep 2026 09:06 UTC · ran for
10s, success 9s, success 10s, success 10s, success 12s, success 13s, success 13s, success 12s, success 12s, success 12s, success avg 11s ± 1s over the last 10 runs
fix: disambiguate parameterized scroll sequences
$ test failure · exit 1 · raw
++ mktemp -d
+ checkout=/tmp/tmp.9WOZMUDZNY
+ trap 'rm -rf "$checkout"' EXIT
+ cp -R /var/lib/ci-tron/sources/1de79c745e76b5b5/. /tmp/tmp.9WOZMUDZNY
+ cd /tmp/tmp.9WOZMUDZNY
+ nix develop --command odin test . -all-packages
GC Warning: Could not open /proc/stat
[INFO ] --- [2026-09-23 09:06:49] Starting test runner with 12 threads. Set with -define:ODIN_TEST_THREADS=n.
[INFO ] --- [2026-09-23 09:06:49] The random seed sent to every test is: 1343216868045840. Set with -define:ODIN_TEST_RANDOM_SEED=n.
[INFO ] --- [2026-09-23 09:06:49] Memory tracking is enabled. Tests will log their memory usage if there's an issue.
[INFO ] --- [2026-09-23 09:06:49] < Final Mem/ Total Mem> < Peak Mem> (#Free/Alloc) :: [package.test_name]
Fontconfig error: No writable cache directories
/tmp/tmp.EmE52rcBR4/.cache/fontconfig
/var/cache/fontconfig
/nix/store/q1bm68zxq6gda6z0i416gaq87qxvyxwp-fc-cache
term: --class requires an argument
term: -e requires a command
usage: term [--class <app_id>] [--working-directory <dir>] [-e <command> [args...]]
usage: term [--class <app_id>] [--working-directory <dir>] [-e <command> [args...]]
term: --working-directory requires an argument
usage: term [--class <app_id>] [--working-directory <dir>] [-e <command> [args...]]
term: unknown flag "--bogus"
usage: term [--class <app_id>] [--working-directory <dir>] [-e <command> [args...]]
[ERROR] --- [2026-09-23 09:06:49] [terminfo_test.odin:441:test_terminfo_source_infocmp_round_trip()] expected state.exit_code == 0 to be true
[ERROR] --- [2026-09-23 09:06:49] [terminfo_test.odin:442:test_terminfo_source_infocmp_round_trip()] expected strings.contains(string(stdout), "smacs") to be true
[ERROR] --- [2026-09-23 09:06:49] [terminfo_test.odin:443:test_terminfo_source_infocmp_round_trip()] expected strings.contains(string(stdout), "setaf") to be true
[ERROR] --- [2026-09-23 09:06:49] [terminfo_test.odin:463:test_terminfo_source_tput_longname()] expected state.exit_code == 0 to be true
[ERROR] --- [2026-09-23 09:06:49] [terminfo_test.odin:464:test_terminfo_source_tput_longname()] expected strings.contains(string(stdout), "term terminal emulator with 256 colors") to be true
Finished 495 tests in 934.225785ms. 2 tests failed.
- main.test_terminfo_source_infocmp_round_trip expected strings.contains(string(stdout), "setaf") to be true
- main.test_terminfo_source_tput_longname expected strings.contains(string(stdout), "term terminal emulator with 256 colors") to be true
To run only the failed tests, use:
-define:ODIN_TEST_NAMES=main.test_terminfo_source_infocmp_round_trip,main.test_terminfo_source_tput_longname,
If your terminal supports OSC 52, you may use -define:ODIN_TEST_CLIPBOARD to have this copied directly to your clipboard.
+ rm -rf /tmp/tmp.9WOZMUDZNY
Artifacts

no artifacts