failure
test ant/term ↗
main @ 0c0b41a5a30a21b9e39f7a272c409783410d4cd4
· pipeline test #106 →
· 2 more pipelines from this commit →
started 23 Sep 2026 09:23 UTC · ran for
avg 11s ± 1s over the last 10 runs
++ mktemp -d
+ checkout=/tmp/tmp.CGsB0qViR8
+ trap 'rm -rf "$checkout"' EXIT
+ cp -R /var/lib/ci-tron/sources/dc1b96d63c65deaa/. /tmp/tmp.CGsB0qViR8
+ cd /tmp/tmp.CGsB0qViR8
+ nix develop --command odin test . -all-packages
GC Warning: Could not open /proc/stat
[INFO ] --- [2026-09-23 09:23:41] Starting test runner with 12 threads. Set with -define:ODIN_TEST_THREADS=n.
[INFO ] --- [2026-09-23 09:23:41] The random seed sent to every test is: 1346716642447080. Set with -define:ODIN_TEST_RANDOM_SEED=n.
[INFO ] --- [2026-09-23 09:23:41] Memory tracking is enabled. Tests will log their memory usage if there's an issue.
[INFO ] --- [2026-09-23 09:23:41] < Final Mem/ Total Mem> < Peak Mem> (#Free/Alloc) :: [package.test_name]
term: --class requires an argument
usage: term [--class <app_id>] [--working-directory <dir>] [-e <command> [args...]]
term: -e requires a command
usage: term [--class <app_id>] [--working-directory <dir>] [-e <command> [args...]]
term: --working-directory requires an argument
usage: term [--class <app_id>] [--working-directory <dir>] [-e <command> [args...]]
term: unknown flag "--bogus"
usage: term [--class <app_id>] [--working-directory <dir>] [-e <command> [args...]]
[ERROR] --- [2026-09-23 09:23:41] [terminfo_test.odin:441:test_terminfo_source_infocmp_round_trip()] expected state.exit_code == 0 to be true
[ERROR] --- [2026-09-23 09:23:41] [terminfo_test.odin:442:test_terminfo_source_infocmp_round_trip()] expected strings.contains(string(stdout), "smacs") to be true
[ERROR] --- [2026-09-23 09:23:41] [terminfo_test.odin:443:test_terminfo_source_infocmp_round_trip()] expected strings.contains(string(stdout), "setaf") to be true
[ERROR] --- [2026-09-23 09:23:41] [terminfo_test.odin:463:test_terminfo_source_tput_longname()] expected state.exit_code == 0 to be true
[ERROR] --- [2026-09-23 09:23:41] [terminfo_test.odin:464:test_terminfo_source_tput_longname()] expected strings.contains(string(stdout), "term terminal emulator with 256 colors") to be true
Finished 499 tests in 927.005892ms. 2 tests failed.
- main.test_terminfo_source_infocmp_round_trip expected strings.contains(string(stdout), "setaf") to be true
- main.test_terminfo_source_tput_longname expected strings.contains(string(stdout), "term terminal emulator with 256 colors") to be true
To run only the failed tests, use:
-define:ODIN_TEST_NAMES=main.test_terminfo_source_infocmp_round_trip,main.test_terminfo_source_tput_longname,
If your terminal supports OSC 52, you may use -define:ODIN_TEST_CLIPBOARD to have this copied directly to your clipboard.
+ rm -rf /tmp/tmp.CGsB0qViR8
no artifacts